Information card for entry 4349775
Common name | Co(L2)2(ClO4)2 |
Chemical name | 2 |
Formula | C30 H38 Cl2 Co N6 O12 |
Calculated formula | C30 H38 Cl2 Co N6 O12 |
Title of publication | Probing the influence of molecular symmetry on the magnetic anisotropy of octahedral cobalt(ii) complexes |
Authors of publication | Ding, Zhong-Yu; Meng, Yin-Shan; Xiao, Yi; Zhang, Yi-Quan; Zhu, Yuan-Yuan; Gao, Song |
Journal of publication | Inorganic Chemistry Frontiers |
Year of publication | 2017 |
Journal volume | 4 |
Journal issue | 11 |
Pages of publication | 1909 |
a | 13.8991 ± 0.0004 Å |
b | 19.9517 ± 0.0006 Å |
c | 25.3128 ± 0.0008 Å |
α | 90° |
β | 90° |
γ | 90° |
Cell volume | 7019.5 ± 0.4 Å3 |
Cell temperature | 180 ± 0.1 K |
Ambient diffraction temperature | 180 ± 0.1 K |
Number of distinct elements | 6 |
Space group number | 61 |
Hermann-Mauguin space group symbol | P b c a |
Hall space group symbol | -P 2ac 2ab |
Residual factor for all reflections | 0.0868 |
Residual factor for significantly intense reflections | 0.0672 |
Weighted residual factors for significantly intense reflections | 0.1695 |
Weighted residual factors for all reflections included in the refinement | 0.1865 |
Goodness-of-fit parameter for all reflections included in the refinement | 1.022 |
Diffraction radiation wavelength | 0.71073 Å |
Diffraction radiation type | MoKα |