Information card for entry 4349783
Formula | C12 H13 N5 O3 Zn |
Calculated formula | C12 H13 N5 O3 Zn |
Title of publication | A highly selective and sensitive Zn(ii) coordination polymer luminescent sensor for Al3+and NACs in the aqueous phase |
Authors of publication | Zhang, Xiao; Luo, Xuan; Zhang, Nanxi; Wu, Jie; Huang, Yong-Qing |
Journal of publication | Inorganic Chemistry Frontiers |
Year of publication | 2017 |
Journal volume | 4 |
Journal issue | 11 |
Pages of publication | 1888 |
a | 8.0423 ± 0.0004 Å |
b | 10.5269 ± 0.0004 Å |
c | 32.6069 ± 0.0014 Å |
α | 90° |
β | 90° |
γ | 90° |
Cell volume | 2760.5 ± 0.2 Å3 |
Cell temperature | 293 ± 2 K |
Ambient diffraction temperature | 293 ± 2 K |
Number of distinct elements | 5 |
Space group number | 61 |
Hermann-Mauguin space group symbol | P b c a |
Hall space group symbol | -P 2ac 2ab |
Residual factor for all reflections | 0.0751 |
Residual factor for significantly intense reflections | 0.0428 |
Weighted residual factors for significantly intense reflections | 0.0575 |
Weighted residual factors for all reflections included in the refinement | 0.0678 |
Goodness-of-fit parameter for all reflections included in the refinement | 0.951 |
Diffraction radiation probe | x-ray |
Diffraction radiation wavelength | 0.71073 Å |
Diffraction radiation type | MoKα |