Information card for entry 4349797
Formula | C5 O8 Pr |
Calculated formula | C5 O8 Pr |
Title of publication | Structural diversities of squarate-based complexes: photocurrent responses and thermochromic behaviours enchanced by viologens |
Authors of publication | Lin, Xiao-Yan; Zhao, Li-Ming; Wang, Dao-Hua; Wang, Yu-Kang; Li, Min; Li, Hao-Hong; Chen, Zhi-Rong |
Journal of publication | Inorganic Chemistry Frontiers |
Year of publication | 2018 |
Journal volume | 5 |
Journal issue | 1 |
Pages of publication | 189 |
a | 9.596 ± 0.0019 Å |
b | 9.923 ± 0.002 Å |
c | 10.004 ± 0.002 Å |
α | 90° |
β | 118.6 ± 0.03° |
γ | 90° |
Cell volume | 836.4 ± 0.4 Å3 |
Cell temperature | 173 ± 2 K |
Ambient diffraction temperature | 173 ± 2 K |
Number of distinct elements | 3 |
Space group number | 14 |
Hermann-Mauguin space group symbol | P 1 21/c 1 |
Hall space group symbol | -P 2ybc |
Residual factor for all reflections | 0.0302 |
Residual factor for significantly intense reflections | 0.0297 |
Weighted residual factors for significantly intense reflections | 0.1042 |
Weighted residual factors for all reflections included in the refinement | 0.1053 |
Goodness-of-fit parameter for all reflections included in the refinement | 0.968 |
Diffraction radiation wavelength | 0.71073 Å |
Diffraction radiation type | MoKα |