Information card for entry 4349803
Formula | C20 H17 Cl2 N3 O4 S Zn |
Calculated formula | C20 H17 Cl2 N3 O4 S Zn |
Title of publication | One-step synthesis of ZnS-N/C nanocomposites derived from Zn-based chiral metal‒organic frameworks with highly efficient photocatalytic activity for the selective oxidation of cis-cyclooctene |
Authors of publication | Lin, Xiaoling; Liu, Beibei; Huang, Hui; Shi, Chunfeng; Liu, Yang; Kang, Zhenhui |
Journal of publication | Inorganic Chemistry Frontiers |
Year of publication | 2018 |
Journal volume | 5 |
Journal issue | 3 |
Pages of publication | 723 |
a | 17.3808 ± 0.001 Å |
b | 10.3874 ± 0.0006 Å |
c | 14.2015 ± 0.0013 Å |
α | 90° |
β | 125.004 ± 0.001° |
γ | 90° |
Cell volume | 2100.2 ± 0.3 Å3 |
Cell temperature | 296 ± 2 K |
Ambient diffraction temperature | 296 ± 2 K |
Number of distinct elements | 7 |
Space group number | 5 |
Hermann-Mauguin space group symbol | C 1 2 1 |
Hall space group symbol | C 2y |
Residual factor for all reflections | 0.0199 |
Residual factor for significantly intense reflections | 0.0189 |
Weighted residual factors for significantly intense reflections | 0.0457 |
Weighted residual factors for all reflections included in the refinement | 0.0461 |
Goodness-of-fit parameter for all reflections included in the refinement | 0.989 |
Diffraction radiation wavelength | 0.71073 Å |
Diffraction radiation type | MoKα |