Information card for entry 4349818
Formula | C26 H53 Ag6 I9 N8 Nd O8 |
Calculated formula | C26 H53 Ag6 I9 N8 Nd O8 |
Title of publication | Iodoargentate/iodobismuthate-based materials hybridized with lanthanide-containing metalloviologens: thermochromic behaviors and photocurrent responses |
Authors of publication | Wang, Dao-Hua; Zhao, Li-Ming; Lin, Xiao-Yan; Wang, Yu-Kang; Zhang, Wen-Ting; Song, Kai-Yue; Li, Hao-Hong; Chen, Zhi-Rong |
Journal of publication | Inorganic Chemistry Frontiers |
Year of publication | 2018 |
Journal volume | 5 |
Journal issue | 5 |
Pages of publication | 1162 |
a | 10.499 ± 0.002 Å |
b | 14.682 ± 0.003 Å |
c | 20.146 ± 0.004 Å |
α | 79.35 ± 0.03° |
β | 81.36 ± 0.03° |
γ | 88.86 ± 0.03° |
Cell volume | 3017.2 ± 1.1 Å3 |
Cell temperature | 293 ± 2 K |
Ambient diffraction temperature | 293 ± 2 K |
Number of distinct elements | 7 |
Space group number | 2 |
Hermann-Mauguin space group symbol | P -1 |
Hall space group symbol | -P 1 |
Residual factor for all reflections | 0.1032 |
Residual factor for significantly intense reflections | 0.0705 |
Weighted residual factors for significantly intense reflections | 0.1869 |
Weighted residual factors for all reflections included in the refinement | 0.2066 |
Goodness-of-fit parameter for all reflections included in the refinement | 1.04 |
Diffraction radiation wavelength | 0.71073 Å |
Diffraction radiation type | MoKα |