Information card for entry 4349861
Formula |
C80 H66 Cl12 O14 Y2 |
Calculated formula |
C40 H33 Cl6 O7 Y |
Title of publication |
Dramatic impact of the lattice solvent on the dynamic magnetic relaxation of dinuclear dysprosium single-molecule magnets |
Authors of publication |
Zhang, Wan-Ying; Zhang, Yi-Quan; Jiang, Shang-Da; Sun, Wen-Bin; Li, Hong-Feng; Wang, Bing-Wu; Chen, Peng; Yan, Peng-Fei; Gao, Song |
Journal of publication |
Inorganic Chemistry Frontiers |
Year of publication |
2018 |
Journal volume |
5 |
Journal issue |
7 |
Pages of publication |
1575 |
a |
11.7403 ± 0.0007 Å |
b |
13.8267 ± 0.0008 Å |
c |
13.9874 ± 0.0009 Å |
α |
103.008 ± 0.005° |
β |
92.037 ± 0.005° |
γ |
108.773 ± 0.005° |
Cell volume |
2080.2 ± 0.2 Å3 |
Number of distinct elements |
5 |
Space group number |
1 |
Hermann-Mauguin space group symbol |
P 1 |
Hall space group symbol |
P 1 |
Residual factor for all reflections |
0.104 |
Yes |
No |
No |