Information card for entry 4349863
Formula | C80 H66 Cl12 Gd2 O14 |
Calculated formula | C80 H66 Cl12 Gd2 O14 |
SMILES | C[O]1c2cccc3c2[O]2[Gd]4561([O]=C(c1ccccc1)C=C(O4)c1ccccc1)(OC(=CC(=[O]5)c1ccccc1)c1ccccc1)[O]1c4c(cccc4[O]6C)[O](C)[Gd]4521([O]3C)([O]=C(c1ccccc1)C=C(O4)c1ccccc1)OC(=CC(=[O]5)c1ccccc1)c1ccccc1.C(Cl)(Cl)Cl.C(Cl)(Cl)Cl.C(Cl)(Cl)Cl.C(Cl)(Cl)Cl |
Title of publication | Dramatic impact of the lattice solvent on the dynamic magnetic relaxation of dinuclear dysprosium single-molecule magnets |
Authors of publication | Zhang, Wan-Ying; Zhang, Yi-Quan; Jiang, Shang-Da; Sun, Wen-Bin; Li, Hong-Feng; Wang, Bing-Wu; Chen, Peng; Yan, Peng-Fei; Gao, Song |
Journal of publication | Inorganic Chemistry Frontiers |
Year of publication | 2018 |
Journal volume | 5 |
Journal issue | 7 |
Pages of publication | 1575 |
a | 11.765 Å |
b | 13.856 Å |
c | 14.01 Å |
α | 102.86° |
β | 91.29° |
γ | 108.64° |
Cell volume | 2098.9 Å3 |
Cell temperature | 293 K |
Ambient diffraction temperature | 293 K |
Number of distinct elements | 5 |
Space group number | 2 |
Hermann-Mauguin space group symbol | P -1 |
Hall space group symbol | -P 1 |
Residual factor for all reflections | 0.0599 |
Residual factor for significantly intense reflections | 0.0431 |
Weighted residual factors for significantly intense reflections | 0.1018 |
Weighted residual factors for all reflections included in the refinement | 0.1166 |
Goodness-of-fit parameter for all reflections included in the refinement | 1.083 |
Diffraction radiation wavelength | 0.71 Å |
Diffraction radiation type | MoKα |