Information card for entry 4349865
Formula | C21 H25.33 K1.12 N12 Nd2 O17.23 W |
Calculated formula | C21 H8 K1.125 N12 Nd2 O17.225 W |
Title of publication | Cyanide-bridged coordination polymers constructed from lanthanide ions and octacyanometallate building-blocks |
Authors of publication | Gao, Yuan; Viciano-Chumillas, Marta; Toader, Ana Maria; Teat, Simon J.; Ferbinteanu, Marilena; Tanase, Stefania |
Journal of publication | Inorganic Chemistry Frontiers |
Year of publication | 2018 |
Journal volume | 5 |
Journal issue | 8 |
Pages of publication | 1967 |
a | 27.0729 ± 0.0011 Å |
b | 17.4291 ± 0.0007 Å |
c | 15.412 ± 0.0007 Å |
α | 90° |
β | 96.264 ± 0.002° |
γ | 90° |
Cell volume | 7228.8 ± 0.5 Å3 |
Cell temperature | 100 ± 2 K |
Ambient diffraction temperature | 100 ± 2 K |
Number of distinct elements | 7 |
Space group number | 15 |
Hermann-Mauguin space group symbol | C 1 2/c 1 |
Hall space group symbol | -C 2yc |
Residual factor for all reflections | 0.0249 |
Residual factor for significantly intense reflections | 0.0209 |
Weighted residual factors for significantly intense reflections | 0.0562 |
Weighted residual factors for all reflections included in the refinement | 0.0575 |
Goodness-of-fit parameter for all reflections included in the refinement | 1.057 |
Diffraction radiation wavelength | 0.7749 Å |
Diffraction radiation type | synchrotron |