Information card for entry 4349867
Formula | C50 H26 Cu3 O15 |
Calculated formula | C50 H26 Cu3 O15 |
Title of publication | Solvent-induced framework-interpenetration isomers of Cu MOFs for efficient light hydrocarbon separation |
Authors of publication | Wang, Yutong; Fan, Weidong; Wang, Xia; Han, Yinfeng; Zhang, Liangliang; Liu, Di; Dai, Fangna; Sun, Daofeng |
Journal of publication | Inorganic Chemistry Frontiers |
Year of publication | 2018 |
Journal volume | 5 |
Journal issue | 10 |
Pages of publication | 2408 |
a | 31.3382 ± 0.0011 Å |
b | 31.3382 ± 0.0011 Å |
c | 39.0786 ± 0.001 Å |
α | 90° |
β | 90° |
γ | 90° |
Cell volume | 38378 ± 2 Å3 |
Cell temperature | 273.45 ± 0.1 K |
Ambient diffraction temperature | 273.45 ± 0.1 K |
Number of distinct elements | 4 |
Space group number | 140 |
Hermann-Mauguin space group symbol | I 4/m c m |
Hall space group symbol | -I 4 2c |
Residual factor for all reflections | 0.1478 |
Residual factor for significantly intense reflections | 0.064 |
Weighted residual factors for significantly intense reflections | 0.1436 |
Weighted residual factors for all reflections included in the refinement | 0.1698 |
Goodness-of-fit parameter for all reflections included in the refinement | 0.731 |
Diffraction radiation probe | x-ray |
Diffraction radiation wavelength | 1.54184 Å |
Diffraction radiation type | CuKα |