Information card for entry 4349879
Formula | C35 H17 Cu2 N3 O11 |
Calculated formula | C35 H17 Cu2 N3 O11 |
Title of publication | An unprecedented water stable acylamide-functionalized metal‒organic framework for highly efficient CH4/CO2 gas storage/separation and acid‒base cooperative catalytic activity |
Authors of publication | Zheng, Baishu; Luo, Xin; Wang, Zhaoxu; Zhang, Shaowei; Yun, Ruirui; Huang, Lu; Zeng, Wenjiang; Liu, Wenlong |
Journal of publication | Inorganic Chemistry Frontiers |
Year of publication | 2018 |
Journal volume | 5 |
Journal issue | 9 |
Pages of publication | 2355 |
a | 36.244 ± 0.008 Å |
b | 36.244 ± 0.008 Å |
c | 36.244 ± 0.008 Å |
α | 90° |
β | 90° |
γ | 90° |
Cell volume | 47611 ± 18 Å3 |
Cell temperature | 293 ± 2 K |
Ambient diffraction temperature | 293 ± 2 K |
Number of distinct elements | 5 |
Space group number | 229 |
Hermann-Mauguin space group symbol | I m -3 m |
Hall space group symbol | -I 4 2 3 |
Residual factor for all reflections | 0.056 |
Residual factor for significantly intense reflections | 0.0466 |
Weighted residual factors for significantly intense reflections | 0.1309 |
Weighted residual factors for all reflections included in the refinement | 0.1375 |
Goodness-of-fit parameter for all reflections included in the refinement | 1.106 |
Diffraction radiation wavelength | 0.71073 Å |
Diffraction radiation type | MoKα |