Information card for entry 4349882
Formula | C48 H44 N6 O6 Zn2 |
Calculated formula | C48 H44 N6 O6 Zn2 |
Title of publication | A flexible metal‒organic framework with adaptive pores for high column-capacity gas chromatographic separation |
Authors of publication | He, Chun-Ting; Ye, Zi-Ming; Xu, Yan-Tong; Xie, Yi; Lian, Xin-Lu; Zhang, Jie-Peng; Chen, Xiao-Ming |
Journal of publication | Inorganic Chemistry Frontiers |
Year of publication | 2018 |
Journal volume | 5 |
Journal issue | 11 |
Pages of publication | 2777 |
a | 17.2385 ± 0.0011 Å |
b | 22.536 ± 0.0014 Å |
c | 23.4694 ± 0.0015 Å |
α | 90° |
β | 90° |
γ | 90° |
Cell volume | 9117.6 ± 1 Å3 |
Cell temperature | 153 ± 2 K |
Ambient diffraction temperature | 153.15 K |
Number of distinct elements | 5 |
Space group number | 73 |
Hermann-Mauguin space group symbol | I b c a |
Hall space group symbol | -I 2b 2c |
Residual factor for all reflections | 0.0765 |
Residual factor for significantly intense reflections | 0.057 |
Weighted residual factors for significantly intense reflections | 0.1411 |
Weighted residual factors for all reflections included in the refinement | 0.1539 |
Goodness-of-fit parameter for all reflections included in the refinement | 1.059 |
Diffraction radiation wavelength | 0.71073 Å |
Diffraction radiation type | MoKα |