Information card for entry 4349884
Formula | C36 H32 N6 O6 Zn2 |
Calculated formula | C36 H32 N6 O6 Zn2 |
Title of publication | A flexible metal‒organic framework with adaptive pores for high column-capacity gas chromatographic separation |
Authors of publication | He, Chun-Ting; Ye, Zi-Ming; Xu, Yan-Tong; Xie, Yi; Lian, Xin-Lu; Zhang, Jie-Peng; Chen, Xiao-Ming |
Journal of publication | Inorganic Chemistry Frontiers |
Year of publication | 2018 |
Journal volume | 5 |
Journal issue | 11 |
Pages of publication | 2777 |
a | 29.427 ± 0.0019 Å |
b | 16.46 ± 0.001 Å |
c | 22.586 ± 0.0014 Å |
α | 90° |
β | 128.488 ± 0.001° |
γ | 90° |
Cell volume | 8563.1 ± 0.9 Å3 |
Cell temperature | 153 ± 2 K |
Ambient diffraction temperature | 153.15 K |
Number of distinct elements | 5 |
Space group number | 15 |
Hermann-Mauguin space group symbol | C 1 2/c 1 |
Hall space group symbol | -C 2yc |
Residual factor for all reflections | 0.0848 |
Residual factor for significantly intense reflections | 0.056 |
Weighted residual factors for significantly intense reflections | 0.1193 |
Weighted residual factors for all reflections included in the refinement | 0.1341 |
Goodness-of-fit parameter for all reflections included in the refinement | 1.055 |
Diffraction radiation wavelength | 0.71073 Å |
Diffraction radiation type | MoKα |