Information card for entry 4349886
Formula | C40 H48 N6 O10 Zn2 |
Calculated formula | C40 H40 N6 O10 Zn2 |
Title of publication | A flexible metal‒organic framework with adaptive pores for high column-capacity gas chromatographic separation |
Authors of publication | He, Chun-Ting; Ye, Zi-Ming; Xu, Yan-Tong; Xie, Yi; Lian, Xin-Lu; Zhang, Jie-Peng; Chen, Xiao-Ming |
Journal of publication | Inorganic Chemistry Frontiers |
Year of publication | 2018 |
Journal volume | 5 |
Journal issue | 11 |
Pages of publication | 2777 |
a | 28.3668 ± 0.0017 Å |
b | 16.5004 ± 0.001 Å |
c | 22.5401 ± 0.0013 Å |
α | 90° |
β | 126.749 ± 0.001° |
γ | 90° |
Cell volume | 8453.5 ± 0.9 Å3 |
Cell temperature | 153 ± 2 K |
Ambient diffraction temperature | 153.15 K |
Number of distinct elements | 5 |
Space group number | 15 |
Hermann-Mauguin space group symbol | C 1 2/c 1 |
Hall space group symbol | -C 2yc |
Residual factor for all reflections | 0.0624 |
Residual factor for significantly intense reflections | 0.0506 |
Weighted residual factors for significantly intense reflections | 0.1323 |
Weighted residual factors for all reflections included in the refinement | 0.1397 |
Goodness-of-fit parameter for all reflections included in the refinement | 1.07 |
Diffraction radiation wavelength | 0.71073 Å |
Diffraction radiation type | MoKα |