Information card for entry 4349890
Formula | C38 H22 F9 Gd N4 O6 S3 |
Calculated formula | C37.977 H22 F9 Gd N4 O6 S3 |
Title of publication | Heteroleptic β-diketonate Ln(iii) complexes decorated with pyridyl substituted pyridazine ligands: synthesis, structure and luminescence properties |
Authors of publication | Khistiaeva, Viktoria V.; Melnikov, Alexey S.; Slavova, Sofia O.; Sizov, Vladimir V.; Starova, Galina L.; Koshevoy, Igor O.; Grachova, Elena V. |
Journal of publication | Inorganic Chemistry Frontiers |
Year of publication | 2018 |
Journal volume | 5 |
Journal issue | 12 |
Pages of publication | 3015 |
a | 24.2809 ± 0.0013 Å |
b | 10.2995 ± 0.0007 Å |
c | 16.5074 ± 0.0008 Å |
α | 90° |
β | 94.05 ± 0.006° |
γ | 90° |
Cell volume | 4117.9 ± 0.4 Å3 |
Cell temperature | 100 ± 2 K |
Ambient diffraction temperature | 100 ± 2 K |
Number of distinct elements | 7 |
Space group number | 13 |
Hermann-Mauguin space group symbol | P 1 2/c 1 |
Hall space group symbol | -P 2yc |
Residual factor for all reflections | 0.0767 |
Residual factor for significantly intense reflections | 0.0565 |
Weighted residual factors for significantly intense reflections | 0.118 |
Weighted residual factors for all reflections included in the refinement | 0.1287 |
Goodness-of-fit parameter for all reflections included in the refinement | 1.063 |
Diffraction radiation wavelength | 0.7107 Å |
Diffraction radiation type | MoKα |