Information card for entry 4349934
Formula | C47 H71 Cd N7 O23 |
Calculated formula | C44 H31 Cd N6 O21 |
Title of publication | MOFs containing a linear bis-pyridyl-tris-amide and angular carboxylates: exploration of proton conductivity, water vapor and dye sorptions |
Authors of publication | Konavarapu, Satyanarayana K.; Goswami, Anindita; Kumar, Anaparthi Ganesh; Banerjee, Susanta; Biradha, Kumar |
Journal of publication | Inorganic Chemistry Frontiers |
Year of publication | 2019 |
Journal volume | 6 |
Journal issue | 1 |
Pages of publication | 184 |
a | 10.029 ± 0.006 Å |
b | 13.435 ± 0.007 Å |
c | 22.07 ± 0.013 Å |
α | 104.66 ± 0.02° |
β | 96.42 ± 0.03° |
γ | 95.68 ± 0.03° |
Cell volume | 2834 ± 3 Å3 |
Cell temperature | 293 ± 2 K |
Ambient diffraction temperature | 293 ± 2 K |
Number of distinct elements | 5 |
Space group number | 2 |
Hermann-Mauguin space group symbol | P -1 |
Hall space group symbol | -P 1 |
Residual factor for all reflections | 0.1077 |
Residual factor for significantly intense reflections | 0.0813 |
Weighted residual factors for significantly intense reflections | 0.2176 |
Weighted residual factors for all reflections included in the refinement | 0.2312 |
Goodness-of-fit parameter for all reflections included in the refinement | 1.361 |
Diffraction radiation wavelength | 0.71073 Å |
Diffraction radiation type | MoKα |