Information card for entry 4349968
Common name | [Cu(NNN-iPr-ligand)(CN)(THF)](Me4N) |
Formula | C40 H57 Cu N5 O3 |
Calculated formula | C40 H57 Cu N5 O3 |
Title of publication | Base induced C‒CN bond cleavage at room temperature: a convenient method for the activation of acetonitrile |
Authors of publication | Zhang, Xiaofeng; Zhang, Zilong; Xiang, Shiqun; Zhu, Yingzu; Chen, Changneng; Huang, Deguang |
Journal of publication | Inorganic Chemistry Frontiers |
Year of publication | 2019 |
Journal volume | 6 |
Journal issue | 5 |
Pages of publication | 1135 |
a | 10.7968 ± 0.0003 Å |
b | 16.0879 ± 0.0003 Å |
c | 12.1844 ± 0.0003 Å |
α | 90° |
β | 112.318 ± 0.003° |
γ | 90° |
Cell volume | 1957.87 ± 0.09 Å3 |
Cell temperature | 150 ± 2 K |
Ambient diffraction temperature | 150 ± 2 K |
Number of distinct elements | 5 |
Space group number | 4 |
Hermann-Mauguin space group symbol | P 1 21 1 |
Hall space group symbol | P 2yb |
Residual factor for all reflections | 0.0375 |
Residual factor for significantly intense reflections | 0.0366 |
Weighted residual factors for significantly intense reflections | 0.1008 |
Weighted residual factors for all reflections included in the refinement | 0.1017 |
Goodness-of-fit parameter for all reflections included in the refinement | 1.043 |
Diffraction radiation wavelength | 1.54184 Å |
Diffraction radiation type | CuKα |