Information card for entry 4349978
Formula | C30 H40 Cu4 N12 O16 |
Calculated formula | C20 H8 Cu4 N8 O12 |
Title of publication | Two unique copper cluster-based metal‒organic frameworks with high performance for CO2 adsorption and separation |
Authors of publication | Yuan, Jiaqi; Li, Jiantang; Che, Songtian; Li, Guanghua; Liu, Xinyao; Sun, Xiaodong; Zou, Lifei; Zhang, Lirong; Liu, Yunling |
Journal of publication | Inorganic Chemistry Frontiers |
Year of publication | 2019 |
Journal volume | 6 |
Journal issue | 2 |
Pages of publication | 556 |
a | 12.009 ± 0.002 Å |
b | 11.479 ± 0.002 Å |
c | 16.743 ± 0.003 Å |
α | 90° |
β | 93.26 ± 0.03° |
γ | 90° |
Cell volume | 2304.3 ± 0.7 Å3 |
Cell temperature | 293 ± 2 K |
Ambient diffraction temperature | 293 ± 2 K |
Number of distinct elements | 5 |
Space group number | 14 |
Hermann-Mauguin space group symbol | P 1 21/n 1 |
Hall space group symbol | -P 2yn |
Residual factor for all reflections | 0.0349 |
Residual factor for significantly intense reflections | 0.0292 |
Weighted residual factors for significantly intense reflections | 0.0909 |
Weighted residual factors for all reflections included in the refinement | 0.0921 |
Goodness-of-fit parameter for all reflections included in the refinement | 1.17 |
Diffraction radiation wavelength | 0.71073 Å |
Diffraction radiation type | MoKα |