Information card for entry 4350019
Formula | C30 H44 N10 O24 Re6 S8 Tb4 |
Calculated formula | C30 H20 N10 O24 Re6 S8 Tb4 |
Title of publication | Metal‒organic frameworks based on polynuclear lanthanide complexes and octahedral rhenium clusters |
Authors of publication | Litvinova, Yulia M.; Gayfulin, Yakov M.; van Leusen, Jan; Samsonenko, Denis G.; Lazarenko, Vladimir A.; Zubavichus, Yan V.; Kögerler, Paul; Mironov, Yuri V. |
Journal of publication | Inorganic Chemistry Frontiers |
Year of publication | 2019 |
Journal volume | 6 |
Journal issue | 6 |
Pages of publication | 1518 |
a | 22.6022 ± 0.0007 Å |
b | 12.3896 ± 0.0003 Å |
c | 23.5464 ± 0.0007 Å |
α | 90° |
β | 110.93 ± 0.004° |
γ | 90° |
Cell volume | 6158.7 ± 0.3 Å3 |
Cell temperature | 130 ± 2 K |
Ambient diffraction temperature | 130 ± 2 K |
Number of distinct elements | 7 |
Space group number | 14 |
Hermann-Mauguin space group symbol | P 1 21/n 1 |
Hall space group symbol | -P 2yn |
Residual factor for all reflections | 0.0355 |
Residual factor for significantly intense reflections | 0.0291 |
Weighted residual factors for significantly intense reflections | 0.0717 |
Weighted residual factors for all reflections included in the refinement | 0.0743 |
Goodness-of-fit parameter for all reflections included in the refinement | 1.034 |
Diffraction radiation probe | x-ray |
Diffraction radiation wavelength | 0.71073 Å |
Diffraction radiation type | MoKα |