Information card for entry 4350074
Common name | [Cu3(L)2(2-Me-Py)3(H2O)4].2-Me-Py.THF.2H2O |
Formula | C38 H50 Cu3 N8 O15 |
Calculated formula | C38 H50 Cu3 N8 O15 |
Title of publication | Copper(ii) facilitated decarboxylation for the construction of pyridyl‒pyrazole skeletons |
Authors of publication | Xiang, Shiqun; Zhang, Xiaofeng; Chen, Hui; Li, Yinghua; Fan, Weibin; Huang, Deguang |
Journal of publication | Inorganic Chemistry Frontiers |
Year of publication | 2019 |
Journal volume | 6 |
Journal issue | 9 |
Pages of publication | 2359 |
a | 15.3643 ± 0.0002 Å |
b | 16.89 ± 0.0002 Å |
c | 17.5664 ± 0.0002 Å |
α | 90° |
β | 104.544 ± 0.0014° |
γ | 90° |
Cell volume | 4412.46 ± 0.1 Å3 |
Cell temperature | 100 ± 2 K |
Ambient diffraction temperature | 100 ± 2 K |
Number of distinct elements | 5 |
Space group number | 14 |
Hermann-Mauguin space group symbol | P 1 21/n 1 |
Hall space group symbol | -P 2yn |
Residual factor for all reflections | 0.0402 |
Residual factor for significantly intense reflections | 0.0329 |
Weighted residual factors for significantly intense reflections | 0.088 |
Weighted residual factors for all reflections included in the refinement | 0.092 |
Goodness-of-fit parameter for all reflections included in the refinement | 1.033 |
Diffraction radiation wavelength | 1.54184 Å |
Diffraction radiation type | CuKα |