Information card for entry 4350712
Formula | C30 H54 Dy Fe I N2 O2 Si2 |
Calculated formula | C30 H54 Dy Fe I N2 O2 Si2 |
Title of publication | Tetraanionic biphenyl lanthanide complexes as single-molecule magnets. |
Authors of publication | Huang, Wenliang; Le Roy, Jennifer J.; Khan, Saeed I.; Ungur, Liviu; Murugesu, Muralee; Diaconescu, Paula L. |
Journal of publication | Inorganic chemistry |
Year of publication | 2015 |
Journal volume | 54 |
Journal issue | 5 |
Pages of publication | 2374 - 2382 |
a | 11.098 ± 0.005 Å |
b | 11.619 ± 0.005 Å |
c | 16.156 ± 0.01 Å |
α | 101.744 ± 0.007° |
β | 91.826 ± 0.006° |
γ | 118.257 ± 0.004° |
Cell volume | 1776.6 ± 1.6 Å3 |
Cell temperature | 100 ± 2 K |
Ambient diffraction temperature | 100 ± 2 K |
Number of distinct elements | 8 |
Space group number | 2 |
Hermann-Mauguin space group symbol | P -1 |
Hall space group symbol | -P 1 |
Residual factor for all reflections | 0.0699 |
Residual factor for significantly intense reflections | 0.053 |
Weighted residual factors for significantly intense reflections | 0.1181 |
Weighted residual factors for all reflections included in the refinement | 0.1296 |
Goodness-of-fit parameter for all reflections included in the refinement | 1.078 |
Diffraction radiation wavelength | 0.71073 Å |
Diffraction radiation type | MoKα |