Information card for entry 4350744
Formula | C20 H17 Ag2 N6 |
Calculated formula | C20 H17 Ag2 N6 |
Title of publication | Metal-ion controlled solid-state reactivity and photoluminescence in two isomorphous coordination polymers |
Authors of publication | Li, Fang; Lin, Rui-Biao; Wei, Yong-Sheng; Liao, Pei-Qin; Bai, Jie; Xue, Wei; Zhang, Wei-Xiong; Zhang, Jie-Peng; Chen, Xiao-Ming |
Journal of publication | Inorganic Chemistry Frontiers |
Year of publication | 2014 |
Journal volume | 1 |
Journal issue | 2 |
Pages of publication | 172 |
a | 5.7782 ± 0.0002 Å |
b | 20.4081 ± 0.0008 Å |
c | 16.1009 ± 0.0008 Å |
α | 90° |
β | 94.674 ± 0.001° |
γ | 90° |
Cell volume | 1892.34 ± 0.14 Å3 |
Cell temperature | 150 ± 2 K |
Ambient diffraction temperature | 150 ± 2 K |
Number of distinct elements | 4 |
Space group number | 14 |
Hermann-Mauguin space group symbol | P 1 21/c 1 |
Hall space group symbol | -P 2ybc |
Residual factor for all reflections | 0.0374 |
Residual factor for significantly intense reflections | 0.0304 |
Weighted residual factors for significantly intense reflections | 0.0947 |
Weighted residual factors for all reflections included in the refinement | 0.1096 |
Goodness-of-fit parameter for all reflections included in the refinement | 1.005 |
Diffraction radiation wavelength | 0.71073 Å |
Diffraction radiation type | MoKα |