Information card for entry 4350819
Common name |
Dilithium di-μ-sulfido-bis(disulfidophosphate(V)) |
Formula |
Li2 P2 S6 |
Calculated formula |
Li2 P2 S6 |
Title of publication |
Synthesis, Structural Characterization, and Lithium Ion Conductivity of the Lithium Thiophosphate Li2P2S6 |
Authors of publication |
Dietrich, Christian; Weber, Dominik A.; Culver, Sean; Senyshyn, Anatoliy; Sedlmaier, Stefan J.; Indris, Sylvio; Janek, Jürgen; Zeier, Wolfgang G. |
Journal of publication |
Inorganic Chemistry |
Year of publication |
2017 |
Journal volume |
56 |
Journal issue |
11 |
Pages of publication |
6681 - 6687 |
a |
11.1156 ± 0.0009 Å |
b |
7.007 ± 0.0007 Å |
c |
6.5251 ± 0.0005 Å |
α |
90° |
β |
125.572 ± 0.0014° |
γ |
90° |
Cell volume |
413.38 ± 0.06 Å3 |
Number of distinct elements |
3 |
Space group number |
12 |
Hermann-Mauguin space group symbol |
C 1 2/m 1 |
Hall space group symbol |
-C 2y |
Yes |
No |
No |