Information card for entry 4502604
Formula | C12 H10 Cu I N6 |
Calculated formula | C12 H10 Cu I N6 |
Title of publication | Design and Construction of Coordination Polymers by 4-Amino-3,5-bis(n-pyridyl)-1,2,4-triazole (n= 2, 3, 4) Isomers in a Copper(I) Halide System: Diverse Structures Tuned by Isomeric and Anion Effects |
Authors of publication | Li, Baiyan; Peng, Yu; Li, Guanghua; Hua, Jia; Yu, Yang; Jin, Di; Shi, Zhan; Feng, Shouhua |
Journal of publication | Crystal Growth & Design |
Year of publication | 2010 |
Journal volume | 10 |
Journal issue | 5 |
Pages of publication | 2192 |
a | 9.4591 ± 0.0006 Å |
b | 10.2141 ± 0.0006 Å |
c | 14.1803 ± 0.001 Å |
α | 90° |
β | 90.052 ± 0.004° |
γ | 90° |
Cell volume | 1370.05 ± 0.15 Å3 |
Cell temperature | 293 ± 2 K |
Ambient diffraction temperature | 293 ± 2 K |
Number of distinct elements | 5 |
Space group number | 14 |
Hermann-Mauguin space group symbol | P 1 21/c 1 |
Hall space group symbol | -P 2ybc |
Residual factor for all reflections | 0.0264 |
Residual factor for significantly intense reflections | 0.0211 |
Weighted residual factors for significantly intense reflections | 0.051 |
Weighted residual factors for all reflections included in the refinement | 0.0522 |
Goodness-of-fit parameter for all reflections included in the refinement | 0.964 |
Diffraction radiation wavelength | 0.71073 Å |
Diffraction radiation type | MoKα |