Information card for entry 4503152
Formula | C48 H43 Ag2 F6 N5 O6 S6 |
Calculated formula | C48 H43 Ag2 F6 N5 O6 S6 |
Title of publication | Formation of Disilver(I) Metallacycle and One-Dimensional Polymeric Chain from the Same Mononuclear Building Block: Assembly Mechanism upon Crystallization |
Authors of publication | Chen, Chun-Long; Yu, Zhi-Quan; Zhang, Qian; Pan, Mei; Zhang, Jian-Yong; Zhao, Cun-Yuan; Su, Cheng-Yong |
Journal of publication | Crystal Growth & Design |
Year of publication | 2008 |
Journal volume | 8 |
Journal issue | 3 |
Pages of publication | 897 |
a | 20.882 ± 0.003 Å |
b | 15.122 ± 0.002 Å |
c | 17.797 ± 0.003 Å |
α | 90° |
β | 103.184 ± 0.002° |
γ | 90° |
Cell volume | 5471.8 ± 1.4 Å3 |
Cell temperature | 293 ± 2 K |
Ambient diffraction temperature | 293 ± 2 K |
Number of distinct elements | 7 |
Space group number | 15 |
Hermann-Mauguin space group symbol | C 1 2/c 1 |
Hall space group symbol | -C 2yc |
Residual factor for all reflections | 0.0778 |
Residual factor for significantly intense reflections | 0.0541 |
Weighted residual factors for significantly intense reflections | 0.1546 |
Weighted residual factors for all reflections included in the refinement | 0.1707 |
Goodness-of-fit parameter for all reflections included in the refinement | 1.032 |
Diffraction radiation wavelength | 0.71073 Å |
Diffraction radiation type | MoKα |