Information card for entry 4503289
Common name | CoEnOx-26NDS-dmapy |
Formula | C36 H58 Co2 N12 O14 S2 |
Calculated formula | C36 H58 Co2 N12 O14 S2 |
Title of publication | A Series of Guest-Defined Metal-Complex/Disulfonate Frameworks of Hydrogen-Bonded [Co(en)2(ox)]+and 2,6-Naphtalenedisulfonate |
Authors of publication | Wang, Xin-Yi; Sevov, Slavi C. |
Journal of publication | Crystal Growth & Design |
Year of publication | 2008 |
Journal volume | 8 |
Journal issue | 4 |
Pages of publication | 1265 |
a | 29.167 ± 0.0013 Å |
b | 11.8769 ± 0.0006 Å |
c | 13.0194 ± 0.0006 Å |
α | 90° |
β | 106.56 ± 0.002° |
γ | 90° |
Cell volume | 4323 ± 0.4 Å3 |
Cell temperature | 100 ± 2 K |
Ambient diffraction temperature | 100 ± 2 K |
Number of distinct elements | 6 |
Space group number | 15 |
Hermann-Mauguin space group symbol | C 1 2/c 1 |
Hall space group symbol | -C 2yc |
Residual factor for all reflections | 0.0436 |
Residual factor for significantly intense reflections | 0.0359 |
Weighted residual factors for significantly intense reflections | 0.0926 |
Weighted residual factors for all reflections included in the refinement | 0.0969 |
Goodness-of-fit parameter for all reflections included in the refinement | 1.04 |
Diffraction radiation wavelength | 0.71073 Å |
Diffraction radiation type | MoKα |