Information card for entry 4503378
Formula | C21 H18 N2 O6 Zn |
Calculated formula | C21 H18 N2 O6 Zn |
Title of publication | Two Zinc(II) Coordination Polymers Constructed with Rigid 1,4-Benzenedicarboxylate and Flexible 1,4-Bis(imidazol-1-ylmethyl)-2,3,5,6-tetramethylbenzene Linkers: From Interpenetrating Layers to Templated 3D Frameworks |
Authors of publication | Schaate, Andreas; Klingelhöfer, Stefan; Behrens, Peter; Wiebcke, Michael |
Journal of publication | Crystal Growth & Design |
Year of publication | 2008 |
Journal volume | 8 |
Journal issue | 9 |
Pages of publication | 3200 |
a | 8.473 ± 0.003 Å |
b | 10.154 ± 0.003 Å |
c | 13.397 ± 0.003 Å |
α | 68.21 ± 0.03° |
β | 78.64 ± 0.03° |
γ | 77.46 ± 0.04° |
Cell volume | 1036.1 ± 0.6 Å3 |
Cell temperature | 298 K |
Ambient diffraction temperature | 298 K |
Number of distinct elements | 5 |
Space group number | 2 |
Hermann-Mauguin space group symbol | P -1 |
Hall space group symbol | -P 1 |
Residual factor for all reflections | 0.0516 |
Residual factor for significantly intense reflections | 0.0304 |
Weighted residual factors for significantly intense reflections | 0.0569 |
Weighted residual factors for all reflections included in the refinement | 0.0592 |
Goodness-of-fit parameter for all reflections included in the refinement | 0.967 |
Diffraction radiation wavelength | 0.71073 Å |
Diffraction radiation type | MoKα |