Information card for entry 4503410
Formula | C6 H13 Gd O10 |
Calculated formula | C6 H5 Gd O10 |
Title of publication | Crystal Engineering of Complexes of Propane-1,2,3-tricarboxylic Acid (H3tca) with Lanthanide(III) Cations† |
Authors of publication | Cañadillas-Delgado, Laura; Fabelo, Oscar; Pasán, Jorge; Delgado, Fernando S.; Déniz, Maríadel; Sepúlveda, Eliezer; Laz, María-Milagros; Julve, Miguel; Ruiz-Pérez, Catalina |
Journal of publication | Crystal Growth & Design |
Year of publication | 2008 |
Journal volume | 8 |
Journal issue | 4 |
Pages of publication | 1313 |
a | 6.7999 ± 0.0006 Å |
b | 21.193 ± 0.002 Å |
c | 8.5305 ± 0.0004 Å |
α | 90° |
β | 105.125 ± 0.005° |
γ | 90° |
Cell volume | 1186.75 ± 0.17 Å3 |
Cell temperature | 293 ± 2 K |
Ambient diffraction temperature | 293 ± 2 K |
Number of distinct elements | 4 |
Space group number | 14 |
Hermann-Mauguin space group symbol | P 1 21/c 1 |
Hall space group symbol | -P 2ybc |
Residual factor for all reflections | 0.1014 |
Residual factor for significantly intense reflections | 0.0685 |
Weighted residual factors for significantly intense reflections | 0.1542 |
Weighted residual factors for all reflections included in the refinement | 0.1763 |
Goodness-of-fit parameter for all reflections included in the refinement | 1.122 |
Diffraction radiation probe | x-ray |
Diffraction radiation wavelength | 0.71073 Å |
Diffraction radiation type | MoKα |