Information card for entry 4503413
Formula | C18 H34 Dy N5 O13 |
Calculated formula | C18 H31 Dy N5 O13 |
Title of publication | Syntheses, Structures, Near-Infrared, and Visible Luminescence of Lanthanide-Organic Frameworks with Flexible Macrocyclic Polyamine Ligands |
Authors of publication | Zhu, Xiandong; Lü, Jian; Li, Xiaoju; Gao, Shuiying; Li, Guoliang; Xiao, Fuxian; Cao, Rong |
Journal of publication | Crystal Growth & Design |
Year of publication | 2008 |
Journal volume | 8 |
Journal issue | 6 |
Pages of publication | 1897 |
a | 8.9432 ± 0.0012 Å |
b | 12.114 ± 0.002 Å |
c | 13.55 ± 0.002 Å |
α | 101.844 ± 0.01° |
β | 108.954 ± 0.008° |
γ | 111.228 ± 0.007° |
Cell volume | 1204.3 ± 0.4 Å3 |
Cell temperature | 294.15 K |
Ambient diffraction temperature | 294.15 K |
Number of distinct elements | 5 |
Space group number | 2 |
Hermann-Mauguin space group symbol | P -1 |
Hall space group symbol | -P 1 |
Residual factor for all reflections | 0.0354 |
Residual factor for significantly intense reflections | 0.032 |
Weighted residual factors for significantly intense reflections | 0.0872 |
Weighted residual factors for all reflections included in the refinement | 0.0954 |
Goodness-of-fit parameter for all reflections included in the refinement | 1.17 |
Diffraction radiation wavelength | 0.71073 Å |
Diffraction radiation type | MoKα |