Information card for entry 4503430
Formula | C19 H27 Cu N4 O10 |
Calculated formula | C19 H27 Cu N4 O10 |
Title of publication | A Series of Cu(II) Complexes Based on Different Bis(imidazole) Ligands and Organic Acids: Formation of Water Clusters and Fixation of Atmospheric Carbon Dioxide |
Authors of publication | Yang, Jin; Ma, Jian-Fang; Liu, Ying-Ying; Ma, Ji-Cheng; Batten, Stuart R. |
Journal of publication | Crystal Growth & Design |
Year of publication | 2008 |
Journal volume | 8 |
Journal issue | 12 |
Pages of publication | 4383 |
a | 13.915 ± 0.003 Å |
b | 9.6531 ± 0.0019 Å |
c | 17.322 ± 0.004 Å |
α | 90° |
β | 96.56 ± 0.03° |
γ | 90° |
Cell volume | 2311.5 ± 0.9 Å3 |
Cell temperature | 293 ± 2 K |
Ambient diffraction temperature | 293 ± 2 K |
Number of distinct elements | 5 |
Space group number | 14 |
Hermann-Mauguin space group symbol | P 1 21/c 1 |
Hall space group symbol | -P 2ybc |
Residual factor for all reflections | 0.1494 |
Residual factor for significantly intense reflections | 0.0465 |
Weighted residual factors for significantly intense reflections | 0.1078 |
Weighted residual factors for all reflections included in the refinement | 0.126 |
Goodness-of-fit parameter for all reflections included in the refinement | 0.773 |
Diffraction radiation wavelength | 0.71073 Å |
Diffraction radiation type | MoKα |