Information card for entry 4503471
Formula | C10 H7 N O3 Zn |
Calculated formula | C10 H7 N O3 Zn |
Title of publication | Molecular Packing Variation of Crimpled 2D Layers and 3D Uncommon 65.8 Topology: Effect of Ligand on the Construction of Metal−Quinoline-6-carboxylate Polymers |
Authors of publication | Hu, Sheng; Zou, Hua-Hong; Zeng, Ming-Hua; Wang, Qiang-Xin; Liang, Hong |
Journal of publication | Crystal Growth & Design |
Year of publication | 2008 |
Journal volume | 8 |
Journal issue | 7 |
Pages of publication | 2346 |
a | 10.79 ± 0.006 Å |
b | 17.585 ± 0.01 Å |
c | 5.148 ± 0.003 Å |
α | 90° |
β | 90° |
γ | 90° |
Cell volume | 976.8 ± 1 Å3 |
Cell temperature | 293 ± 2 K |
Ambient diffraction temperature | 293 ± 2 K |
Number of distinct elements | 5 |
Space group number | 33 |
Hermann-Mauguin space group symbol | P n a 21 |
Hall space group symbol | P 2c -2n |
Residual factor for all reflections | 0.0231 |
Residual factor for significantly intense reflections | 0.0213 |
Weighted residual factors for significantly intense reflections | 0.0506 |
Weighted residual factors for all reflections included in the refinement | 0.0513 |
Goodness-of-fit parameter for all reflections included in the refinement | 1.071 |
Diffraction radiation wavelength | 0.71073 Å |
Diffraction radiation type | MoKα |