Information card for entry 4503482
Formula | C66 H110 F48 N18 O54 S16 Zn4 |
Calculated formula | C66 H110 F48 N18 O54 S16 Zn4 |
Title of publication | Polynuclear Metal Complexes Obtained from the Task-Specific Ionic Liquid Betainium Bistriflimide |
Authors of publication | Nockemann, Peter; Thijs, Ben; Hecke, Kristof Van; Meervelt, Luc Van; Binnemans, Koen |
Journal of publication | Crystal Growth & Design |
Year of publication | 2008 |
Journal volume | 8 |
Journal issue | 4 |
Pages of publication | 1353 |
a | 13.5478 ± 0.001 Å |
b | 14.4777 ± 0.0011 Å |
c | 20.6903 ± 0.0017 Å |
α | 72.326 ± 0.003° |
β | 89.845 ± 0.003° |
γ | 63.529 ± 0.003° |
Cell volume | 3419.2 ± 0.5 Å3 |
Cell temperature | 100 ± 2 K |
Ambient diffraction temperature | 100 ± 2 K |
Number of distinct elements | 7 |
Space group number | 2 |
Hermann-Mauguin space group symbol | P -1 |
Hall space group symbol | -P 1 |
Residual factor for all reflections | 0.1404 |
Residual factor for significantly intense reflections | 0.0977 |
Weighted residual factors for significantly intense reflections | 0.1962 |
Weighted residual factors for all reflections included in the refinement | 0.2131 |
Goodness-of-fit parameter for all reflections included in the refinement | 1.102 |
Diffraction radiation wavelength | 1.54178 Å |
Diffraction radiation type | CuKα |