Information card for entry 4503509
Formula | C16 H30 N4 O10 U |
Calculated formula | C16 H30 N4 O10 U |
SMILES | [U]12(=O)(=O)([O]=C5N(CCC5)C(C)(C)C)([O]=C5N(CCC5)C(C)(C)C)([O]=N(=O)O1)ON(=[O]2)=O |
Title of publication | Molecular and Crystal Structures of Uranyl Nitrate Complexes withN-Alkylated 2-Pyrrolidone Derivatives: Design and Optimization of Promising Precipitant for Uranyl Ion |
Authors of publication | Takao, Koichiro; Noda, Kyoko; Morita, Yasuji; Nishimura, Kenji; Ikeda, Yasuhisa |
Journal of publication | Crystal Growth & Design |
Year of publication | 2008 |
Journal volume | 8 |
Journal issue | 7 |
Pages of publication | 2364 |
a | 17.364 ± 0.006 Å |
b | 7.385 ± 0.003 Å |
c | 18.031 ± 0.009 Å |
α | 90° |
β | 90° |
γ | 90° |
Cell volume | 2312.2 ± 1.7 Å3 |
Cell temperature | 173 ± 2 K |
Ambient diffraction temperature | 173 ± 2 K |
Number of distinct elements | 5 |
Space group number | 33 |
Hermann-Mauguin space group symbol | P n a 21 |
Hall space group symbol | P 2c -2n |
Residual factor for all reflections | 0.0371 |
Residual factor for significantly intense reflections | 0.0326 |
Weighted residual factors for significantly intense reflections | 0.0827 |
Weighted residual factors for all reflections included in the refinement | 0.0854 |
Goodness-of-fit parameter for all reflections included in the refinement | 1.053 |
Diffraction radiation wavelength | 0.71075 Å |
Diffraction radiation type | MoKα |