Information card for entry 4503544
Common name | [ZnCl(obip)] |
Formula | C14 H9 Cl N4 O Zn |
Calculated formula | C14 H9 Cl N4 O Zn |
Title of publication | A One-Dimensional Coordination Polymer Based on Novel Radical Anion Ligand Generated In Situ: Notable Magnetic and Luminescence Properties |
Authors of publication | Yong, Guo-Ping; Qiao, Shu; Wang, Zhi-Yong |
Journal of publication | Crystal Growth & Design |
Year of publication | 2008 |
Journal volume | 8 |
Journal issue | 5 |
Pages of publication | 1465 |
a | 11.25 ± 0.002 Å |
b | 8.0324 ± 0.0016 Å |
c | 15.068 ± 0.003 Å |
α | 90° |
β | 94.24 ± 0.03° |
γ | 90° |
Cell volume | 1357.9 ± 0.5 Å3 |
Cell temperature | 293 ± 2 K |
Ambient diffraction temperature | 293 ± 2 K |
Number of distinct elements | 6 |
Space group number | 14 |
Hermann-Mauguin space group symbol | P 1 21/n 1 |
Hall space group symbol | -P 2yn |
Residual factor for all reflections | 0.0531 |
Residual factor for significantly intense reflections | 0.0474 |
Weighted residual factors for significantly intense reflections | 0.1326 |
Weighted residual factors for all reflections included in the refinement | 0.1374 |
Goodness-of-fit parameter for all reflections included in the refinement | 1.073 |
Diffraction radiation wavelength | 0.71073 Å |
Diffraction radiation type | MoKα |