Information card for entry 4503681
Formula | C12 H12 Cl2 Cu N18 O8 |
Calculated formula | C12 H12 Cl2 Cu N18 O8.02 |
Title of publication | Anions-Directed Metal-Mediated Assemblies of Coordination Polymers Based on the Bis(4,4′-bis-1,2,4-triazole) Ligand |
Authors of publication | Huang, Yong-Quan; Zhao, Xiao-Qing; Shi, Wei; Liu, Wen-Yong; Chen, Zhong-Lei; Cheng, Peng; Liao, Dai-Zheng; Yan, Shi-Ping |
Journal of publication | Crystal Growth & Design |
Year of publication | 2008 |
Journal volume | 8 |
Journal issue | 10 |
Pages of publication | 3652 |
a | 10.9709 ± 0.0011 Å |
b | 10.9709 ± 0.0011 Å |
c | 35.314 ± 0.006 Å |
α | 90° |
β | 90° |
γ | 120° |
Cell volume | 3681 ± 0.8 Å3 |
Cell temperature | 293 ± 2 K |
Ambient diffraction temperature | 293 ± 2 K |
Number of distinct elements | 6 |
Space group number | 167 |
Hermann-Mauguin space group symbol | R -3 c :H |
Hall space group symbol | -R 3 2"c |
Residual factor for all reflections | 0.0606 |
Residual factor for significantly intense reflections | 0.0571 |
Weighted residual factors for significantly intense reflections | 0.1614 |
Weighted residual factors for all reflections included in the refinement | 0.1657 |
Goodness-of-fit parameter for all reflections included in the refinement | 1.086 |
Diffraction radiation wavelength | 0.71073 Å |
Diffraction radiation type | MoKα |