Information card for entry 4503683
Formula | C36 H32 B4 Cd3 F16 N54 |
Calculated formula | C36 H32 B4 Cd3 F16 N54 |
Title of publication | Anions-Directed Metal-Mediated Assemblies of Coordination Polymers Based on the Bis(4,4′-bis-1,2,4-triazole) Ligand |
Authors of publication | Huang, Yong-Quan; Zhao, Xiao-Qing; Shi, Wei; Liu, Wen-Yong; Chen, Zhong-Lei; Cheng, Peng; Liao, Dai-Zheng; Yan, Shi-Ping |
Journal of publication | Crystal Growth & Design |
Year of publication | 2008 |
Journal volume | 8 |
Journal issue | 10 |
Pages of publication | 3652 |
a | 12.691 ± 0.002 Å |
b | 12.691 ± 0.002 Å |
c | 23.216 ± 0.008 Å |
α | 90° |
β | 90° |
γ | 90° |
Cell volume | 3739.2 ± 1.5 Å3 |
Cell temperature | 294 ± 2 K |
Ambient diffraction temperature | 294 ± 2 K |
Number of distinct elements | 6 |
Space group number | 82 |
Hermann-Mauguin space group symbol | I -4 |
Hall space group symbol | I -4 |
Residual factor for all reflections | 0.045 |
Residual factor for significantly intense reflections | 0.044 |
Weighted residual factors for significantly intense reflections | 0.1454 |
Weighted residual factors for all reflections included in the refinement | 0.1463 |
Goodness-of-fit parameter for all reflections included in the refinement | 1.113 |
Diffraction radiation wavelength | 0.71073 Å |
Diffraction radiation type | MoKα |