Information card for entry 4503711
Formula | C48 H25 N7 Nd2 O18 |
Calculated formula | C48 H25 N7 Nd2 O18 |
Title of publication | Lanthanide Coordination Polymers Constructed from Dinuclear Building Blocks: Novel Structure Evolution from One-Dimensional Chains to Three-Dimensional Architectures |
Authors of publication | Ye, Junwei; Zhang, Jingying; Ning, Guiling; Tian, Ge; Chen, Yan; Wang, Yue |
Journal of publication | Crystal Growth & Design |
Year of publication | 2008 |
Journal volume | 8 |
Journal issue | 8 |
Pages of publication | 3098 |
a | 12.845 ± 0.003 Å |
b | 14.724 ± 0.003 Å |
c | 14.778 ± 0.003 Å |
α | 103.85 ± 0.03° |
β | 90.16 ± 0.03° |
γ | 115.3 ± 0.03° |
Cell volume | 2435.8 ± 1.2 Å3 |
Cell temperature | 293 ± 2 K |
Ambient diffraction temperature | 293 ± 2 K |
Number of distinct elements | 5 |
Space group number | 2 |
Hermann-Mauguin space group symbol | P -1 |
Hall space group symbol | -P 1 |
Residual factor for all reflections | 0.0393 |
Residual factor for significantly intense reflections | 0.0296 |
Weighted residual factors for significantly intense reflections | 0.09 |
Weighted residual factors for all reflections included in the refinement | 0.1022 |
Goodness-of-fit parameter for all reflections included in the refinement | 1.037 |
Diffraction radiation wavelength | 0.71073 Å |
Diffraction radiation type | MoKα |