Information card for entry 4503726
Formula | C32 H25 Cd3 Na2 O24.5 |
Calculated formula | C32 H12 Cd3 Na2 O24.5 |
Title of publication | Three Novel Heterobimetallic Cd/Zn−Na Coordination Polymers: Syntheses, Crystal Structure, and Luminescence |
Authors of publication | Chen, Xiao-Li; Zhang, Bo; Hu, Huai-Ming; Fu, Feng; Wu, Xing-Long; Qin, Ting; Yang, Meng-Lin; Xue, Gang-Lin; Wang, Ji-Wu |
Journal of publication | Crystal Growth & Design |
Year of publication | 2008 |
Journal volume | 8 |
Journal issue | 10 |
Pages of publication | 3706 |
a | 8.649 ± 0.004 Å |
b | 14.763 ± 0.006 Å |
c | 16.033 ± 0.007 Å |
α | 104.344 ± 0.005° |
β | 97.349 ± 0.006° |
γ | 105.907 ± 0.006° |
Cell volume | 1864.8 ± 1.4 Å3 |
Cell temperature | 296 ± 2 K |
Ambient diffraction temperature | 296 ± 2 K |
Number of distinct elements | 5 |
Space group number | 2 |
Hermann-Mauguin space group symbol | P -1 |
Hall space group symbol | -P 1 |
Residual factor for all reflections | 0.098 |
Residual factor for significantly intense reflections | 0.0734 |
Weighted residual factors for significantly intense reflections | 0.1818 |
Weighted residual factors for all reflections included in the refinement | 0.1961 |
Goodness-of-fit parameter for all reflections included in the refinement | 1.07 |
Diffraction radiation wavelength | 0.71073 Å |
Diffraction radiation type | MoKα |