Information card for entry 4503752
Formula | C4 H10 Cu4 N10 O10 S2 |
Calculated formula | C4 H10 Cu4 N10 O10 S2 |
Title of publication | Novel Copper(I)− and Copper(II)−Guanazolate Complexes: Structure, Network Topologies, Photoluminescence, and Magnetic Properties |
Authors of publication | Zhang, Rui-Bo; Zhang, Jian; Li, Zhao-Ji; Cheng, Jian-Kai; Qin, Ye-Yan; Yao, Yuan-Gen |
Journal of publication | Crystal Growth & Design |
Year of publication | 2008 |
Journal volume | 8 |
Journal issue | 10 |
Pages of publication | 3735 |
a | 8.093 ± 0.004 Å |
b | 12.273 ± 0.006 Å |
c | 8.338 ± 0.005 Å |
α | 90° |
β | 110.533 ± 0.009° |
γ | 90° |
Cell volume | 775.6 ± 0.7 Å3 |
Cell temperature | 293.15 K |
Ambient diffraction temperature | 293.15 K |
Number of distinct elements | 6 |
Space group number | 14 |
Hermann-Mauguin space group symbol | P 1 21/n 1 |
Hall space group symbol | -P 2yn |
Residual factor for all reflections | 0.059 |
Residual factor for significantly intense reflections | 0.0496 |
Weighted residual factors for significantly intense reflections | 0.1302 |
Weighted residual factors for all reflections included in the refinement | 0.1345 |
Goodness-of-fit parameter for all reflections included in the refinement | 1.16 |
Diffraction radiation wavelength | 0.71073 Å |
Diffraction radiation type | MoKα |