Information card for entry 4503767
Formula | C30 H21 Co2 N8 O11 Tb |
Calculated formula | C30 H21 Co2 N8 O11 Tb |
Title of publication | Employing An Unprecedented Ferromagnetic Molecular Building Block (MBB) of [Co2Ln(μ3-OH)(CO2)5(N3)]2(Ln = Tb, Gd, Dy, Eu, Sm) to Construct a 6-Connected α-Po Net |
Authors of publication | Yang, Yu-ting; Luo, Feng; Che, Yun-xia; Zheng, Ji-min |
Journal of publication | Crystal Growth & Design |
Year of publication | 2008 |
Journal volume | 8 |
Journal issue | 10 |
Pages of publication | 3508 |
a | 10.925 ± 0.002 Å |
b | 12.028 ± 0.002 Å |
c | 14.663 ± 0.003 Å |
α | 107.87 ± 0.03° |
β | 107.33 ± 0.03° |
γ | 102.11 ± 0.03° |
Cell volume | 1651.6 ± 0.9 Å3 |
Cell temperature | 294 ± 2 K |
Ambient diffraction temperature | 294 ± 2 K |
Number of distinct elements | 6 |
Space group number | 2 |
Hermann-Mauguin space group symbol | P -1 |
Hall space group symbol | -P 1 |
Residual factor for all reflections | 0.0272 |
Residual factor for significantly intense reflections | 0.0244 |
Weighted residual factors for significantly intense reflections | 0.0591 |
Weighted residual factors for all reflections included in the refinement | 0.0605 |
Goodness-of-fit parameter for all reflections included in the refinement | 1.018 |
Diffraction radiation wavelength | 0.71073 Å |
Diffraction radiation type | MoKα |