Information card for entry 4503793
Formula | C18 H25 Cl2 Cu N8 O16.5 |
Calculated formula | C18 H20 Cl2 Cu N8 O16.5 |
Title of publication | Construction of Three-Dimensional Honeycomb-like Supramolecular Host Network with Dicationic Metallotecton Cu[(2-C4H3N2)2C(OH)2]22+through Cooperative Hydrogen-Bonding and Anion-π Interactions |
Authors of publication | Wan, Chong-Qing; Li, Gui-Sheng; Chen, Xu-Dong; Mak, Thomas C. W. |
Journal of publication | Crystal Growth & Design |
Year of publication | 2008 |
Journal volume | 8 |
Journal issue | 11 |
Pages of publication | 3897 |
a | 30.489 ± 0.003 Å |
b | 30.489 ± 0.003 Å |
c | 8.2611 ± 0.0017 Å |
α | 90° |
β | 90° |
γ | 120° |
Cell volume | 6650.5 ± 1.7 Å3 |
Cell temperature | 173 ± 2 K |
Ambient diffraction temperature | 173 ± 2 K |
Number of distinct elements | 6 |
Space group number | 148 |
Hermann-Mauguin space group symbol | R -3 :H |
Hall space group symbol | -R 3 |
Residual factor for all reflections | 0.064 |
Residual factor for significantly intense reflections | 0.0514 |
Weighted residual factors for significantly intense reflections | 0.1511 |
Weighted residual factors for all reflections included in the refinement | 0.1636 |
Goodness-of-fit parameter for all reflections included in the refinement | 1.075 |
Diffraction radiation wavelength | 0.71073 Å |
Diffraction radiation type | MoKα |