Information card for entry 4503818
Common name | 2:1 Co-crystal of 4HBA + Pyrazine |
Chemical name | 2:1 Co-crystal of 4-hydroxybenzoic acid and Pyrazine |
Formula | C9 H8 N O3 |
Calculated formula | C9 H8 N O3 |
Title of publication | Hierarchy of Supramolecular Synthons: Persistent Carboxylic Acid···Pyridine Hydrogen Bonds in Cocrystals That also Contain a Hydroxyl Moiety |
Authors of publication | Shattock, Tanise R.; Arora, Kapildev K.; Vishweshwar, Peddy; Zaworotko, Michael J. |
Journal of publication | Crystal Growth & Design |
Year of publication | 2008 |
Journal volume | 8 |
Journal issue | 12 |
Pages of publication | 4533 |
a | 5.942 ± 0.009 Å |
b | 6.818 ± 0.01 Å |
c | 10.638 ± 0.016 Å |
α | 102.963 ± 0.003° |
β | 97.383 ± 0.002° |
γ | 100.057 ± 0.003° |
Cell volume | 407.2 ± 1.1 Å3 |
Cell temperature | 100 ± 2 K |
Ambient diffraction temperature | 100 ± 2 K |
Number of distinct elements | 4 |
Space group number | 2 |
Hermann-Mauguin space group symbol | P -1 |
Hall space group symbol | -P 1 |
Residual factor for all reflections | 0.0486 |
Residual factor for significantly intense reflections | 0.0456 |
Weighted residual factors for significantly intense reflections | 0.1213 |
Weighted residual factors for all reflections included in the refinement | 0.1306 |
Goodness-of-fit parameter for all reflections included in the refinement | 1.068 |
Diffraction radiation wavelength | 0.71073 Å |
Diffraction radiation type | MoKα |