Information card for entry 4504196
Formula | C22 H20 Cl N6 Ni O2 |
Calculated formula | C22 H20 Cl N6 Ni O2 |
Title of publication | Divalent Metal Succinate/4,4‘-Dipyridylamine Extended Solids: From Helical Chains to Diverse Three-Dimensional Networks Featuring Double, Quadruple, or Self-Interpenetration |
Authors of publication | Montney, Matthew R.; Mallika Krishnan, Subhashree; Patel, Niral M.; Supkowski, Ronald M.; LaDuca, Robert L. |
Journal of publication | Crystal Growth & Design |
Year of publication | 2007 |
Journal volume | 7 |
Journal issue | 6 |
Pages of publication | 1145 |
a | 15.8537 ± 0.0016 Å |
b | 16.7071 ± 0.0017 Å |
c | 16.6416 ± 0.0017 Å |
α | 90° |
β | 90° |
γ | 90° |
Cell volume | 4407.8 ± 0.8 Å3 |
Cell temperature | 173 ± 2 K |
Ambient diffraction temperature | 173 ± 2 K |
Number of distinct elements | 6 |
Space group number | 60 |
Hermann-Mauguin space group symbol | P b c n |
Hall space group symbol | -P 2n 2ab |
Residual factor for all reflections | 0.0445 |
Residual factor for significantly intense reflections | 0.037 |
Weighted residual factors for significantly intense reflections | 0.088 |
Weighted residual factors for all reflections included in the refinement | 0.0918 |
Goodness-of-fit parameter for all reflections included in the refinement | 1.087 |
Diffraction radiation wavelength | 0.71073 Å |
Diffraction radiation type | MoKα |