Information card for entry 4504204
Formula | C21 H22 Cl3 Cu N2 O4.5 S2 |
Calculated formula | C21 H21 Cl3 Cu N2 O4.5 S2 |
Title of publication | Cobalt(II), Copper(II), and Zinc(II) Framework Systems Derived from Ditopic Pyridyl-Acetylacetone and Pyridyl-Pyrazole Ligands |
Authors of publication | Won, Tae-Jin; Clegg, Jack K.; Lindoy, Leonard F.; McMurtrie, John C. |
Journal of publication | Crystal Growth & Design |
Year of publication | 2007 |
Journal volume | 7 |
Journal issue | 5 |
Pages of publication | 972 |
a | 11.0421 ± 0.0009 Å |
b | 14.8315 ± 0.0012 Å |
c | 17.5303 ± 0.0015 Å |
α | 90° |
β | 102.19 ± 0.001° |
γ | 90° |
Cell volume | 2806.2 ± 0.4 Å3 |
Cell temperature | 150 ± 2 K |
Ambient diffraction temperature | 150 ± 2 K |
Number of distinct elements | 7 |
Space group number | 15 |
Hermann-Mauguin space group symbol | C 1 2/c 1 |
Hall space group symbol | -C 2yc |
Residual factor for all reflections | 0.0945 |
Residual factor for significantly intense reflections | 0.0774 |
Weighted residual factors for significantly intense reflections | 0.2168 |
Weighted residual factors for all reflections included in the refinement | 0.2334 |
Goodness-of-fit parameter for all reflections included in the refinement | 1.037 |
Diffraction radiation wavelength | 0.71073 Å |
Diffraction radiation type | MoKα |