Information card for entry 4504214
Chemical name | [(2,3-bis(2-pyridyl)pyrazine)(1-phenyl-closo-1-monocarbadecaborane)silver(I)] acetonitrile clathrate |
Formula | C22 H25.5 Ag B9 N4.5 |
Calculated formula | C22 H24 Ag B9 N4.5 |
Title of publication | One-Dimensional Coordination Polymers with Phenyl-carbaborane Anions: Ag(I)/4,4‘-Bipyridine and 2,3-Bis-(2-pyridyl)pyrazine Complexes |
Authors of publication | Cunha-Silva, Luís; Ahmad, Ruksanna; Carr, Michael J.; Franken, Andreas; Kennedy, John D.; Hardie, Michaele J. |
Journal of publication | Crystal Growth & Design |
Year of publication | 2007 |
Journal volume | 7 |
Journal issue | 4 |
Pages of publication | 658 |
a | 11.8844 ± 0.0002 Å |
b | 14.1195 ± 0.0002 Å |
c | 15.1552 ± 0.0002 Å |
α | 90° |
β | 95.362 ± 0.001° |
γ | 90° |
Cell volume | 2531.94 ± 0.07 Å3 |
Cell temperature | 150 ± 2 K |
Ambient diffraction temperature | 150 ± 2 K |
Number of distinct elements | 5 |
Space group number | 14 |
Hermann-Mauguin space group symbol | P 1 21/c 1 |
Hall space group symbol | -P 2ybc |
Residual factor for all reflections | 0.0399 |
Residual factor for significantly intense reflections | 0.0365 |
Weighted residual factors for significantly intense reflections | 0.0966 |
Weighted residual factors for all reflections included in the refinement | 0.1 |
Goodness-of-fit parameter for all reflections included in the refinement | 1.032 |
Diffraction radiation wavelength | 0.71073 Å |
Diffraction radiation type | MoKα |