Information card for entry 4504222
Formula | C56 H70.5 B6 F24 N29.5 O3 Zn3 |
Calculated formula | C56 H70.5 B6 F24 N29.5 O3 Zn3 |
Title of publication | Metallacyclic Zinc Complexes of Alkylidene-Linked Bitopic Bis(pyrazolyl)methane Ligands: Unusual Exocyclic Bridging Fluoride Ligands |
Authors of publication | Reger, Daniel L.; Watson, Russell P.; Smith, Mark D.; Pellechia, Perry J. |
Journal of publication | Crystal Growth & Design |
Year of publication | 2007 |
Journal volume | 7 |
Journal issue | 6 |
Pages of publication | 1163 |
a | 17.1422 ± 0.0008 Å |
b | 27.0769 ± 0.0012 Å |
c | 19.0568 ± 0.0009 Å |
α | 90° |
β | 95.093 ± 0.001° |
γ | 90° |
Cell volume | 8810.4 ± 0.7 Å3 |
Cell temperature | 150 ± 1 K |
Ambient diffraction temperature | 150 ± 1 K |
Number of distinct elements | 7 |
Space group number | 14 |
Hermann-Mauguin space group symbol | P 1 21/n 1 |
Hall space group symbol | -P 2yn |
Residual factor for all reflections | 0.0839 |
Residual factor for significantly intense reflections | 0.0492 |
Weighted residual factors for significantly intense reflections | 0.1187 |
Weighted residual factors for all reflections included in the refinement | 0.1277 |
Goodness-of-fit parameter for all reflections included in the refinement | 0.878 |
Diffraction radiation wavelength | 0.71073 Å |
Diffraction radiation type | MoKα |