Information card for entry 4504225
Formula | C24 H18 Ag2 B2 F8 N6 |
Calculated formula | C24 H18 Ag2 B2 F8 N6 |
Title of publication | Dimension Increase via Hydrogen Bonding and Weak Coordination Interactions from Simple Complexes of 2-(Pyridyl)benzimidazole Ligands |
Authors of publication | Li, Xiang-Ping; Pan, Mei; Zheng, Sheng-Run; Liu, Yong-Ru; He, Qi-Ting; Kang, Bei-Sheng; Su, Cheng-Yong |
Journal of publication | Crystal Growth & Design |
Year of publication | 2007 |
Journal volume | 7 |
Journal issue | 12 |
Pages of publication | 2481 |
a | 10.374 Å |
b | 10.122 Å |
c | 12.521 Å |
α | 90° |
β | 96.62° |
γ | 90° |
Cell volume | 1306.01 Å3 |
Cell temperature | 293 ± 2 K |
Ambient diffraction temperature | 293 ± 2 K |
Number of distinct elements | 6 |
Space group number | 14 |
Hermann-Mauguin space group symbol | P 1 21/c 1 |
Hall space group symbol | -P 2ybc |
Residual factor for all reflections | 0.0289 |
Residual factor for significantly intense reflections | 0.0241 |
Weighted residual factors for significantly intense reflections | 0.0623 |
Weighted residual factors for all reflections included in the refinement | 0.065 |
Goodness-of-fit parameter for all reflections included in the refinement | 1.088 |
Diffraction radiation wavelength | 0.71073 Å |
Diffraction radiation type | MoKα |