Information card for entry 4504251
Formula | C16 H18 N4 O4 |
Calculated formula | C16 H18 N4 O4 |
SMILES | O=C(Nc1ccc(N(=O)=O)cc1)Nc1ccccc1.N(C=O)(C)C |
Title of publication | Crystal Structures ofN-Aryl-N'-4-Nitrophenyl Ureas: Molecular Conformation and Weak Interactions Direct the Strong Hydrogen Bond Synthon |
Authors of publication | Reddy, L. Sreenivas; Chandran, Sreekanth K.; George, Sumod; Babu, N. Jagadeesh; Nangia, Ashwini |
Journal of publication | Crystal Growth & Design |
Year of publication | 2007 |
Journal volume | 7 |
Journal issue | 12 |
Pages of publication | 2675 - 2690 |
a | 9.4442 ± 0.0019 Å |
b | 7.3883 ± 0.0015 Å |
c | 23.863 ± 0.005 Å |
α | 90° |
β | 97.73 ± 0.03° |
γ | 90° |
Cell volume | 1649.9 ± 0.6 Å3 |
Cell temperature | 293 ± 2 K |
Ambient diffraction temperature | 293 ± 2 K |
Number of distinct elements | 4 |
Space group number | 14 |
Hermann-Mauguin space group symbol | P 1 21/c 1 |
Hall space group symbol | -P 2ybc |
Residual factor for all reflections | 0.1977 |
Residual factor for significantly intense reflections | 0.0783 |
Weighted residual factors for significantly intense reflections | 0.1839 |
Weighted residual factors for all reflections included in the refinement | 0.2408 |
Goodness-of-fit parameter for all reflections included in the refinement | 1.093 |
Diffraction radiation wavelength | 0.71073 Å |
Diffraction radiation type | MoKα |