Information card for entry 4504269
Formula | C9 H5 Cd N2 O6 |
Calculated formula | C9 H5 Cd N2 O6 |
Title of publication | Assemblies of Two New Metal−Organic Frameworks Constructed from Cd(II) with 2,2‘-Bipyrimidine and Cyclic Oxocarbon Dianions CnOn2-(n= 4, 5) |
Authors of publication | Wang, Chih-Chieh; Kuo, Chen-Tsung; Yang, Jing-Chun; Lee, Gene-Hsiang; Shih, Wei-Ju; Sheu, Hwo-Shuenn |
Journal of publication | Crystal Growth & Design |
Year of publication | 2007 |
Journal volume | 7 |
Journal issue | 8 |
Pages of publication | 1476 |
a | 11.3146 ± 0.0006 Å |
b | 7.6357 ± 0.0004 Å |
c | 11.8779 ± 0.0006 Å |
α | 90° |
β | 107.616 ± 0.001° |
γ | 90° |
Cell volume | 978.07 ± 0.09 Å3 |
Cell temperature | 295 ± 2 K |
Ambient diffraction temperature | 295 ± 2 K |
Number of distinct elements | 5 |
Space group number | 12 |
Hermann-Mauguin space group symbol | C 1 2/m 1 |
Hall space group symbol | -C 2y |
Residual factor for all reflections | 0.0257 |
Residual factor for significantly intense reflections | 0.0231 |
Weighted residual factors for significantly intense reflections | 0.0544 |
Weighted residual factors for all reflections included in the refinement | 0.0557 |
Goodness-of-fit parameter for all reflections included in the refinement | 1.026 |
Diffraction radiation wavelength | 0.71073 Å |
Diffraction radiation type | MoKα |