Information card for entry 4504283
Formula | C20 H14 Cd N16 S2 |
Calculated formula | C20 H14 Cd N16 S2 |
Title of publication | Syntheses, Structures, and Characterization of a Series of Novel Zinc(II) and Cadmium(II) Compounds Based on 2,6-Di-(1,2,4-triazole-4-yl)pyridine |
Authors of publication | Liu, Yuan-Yuan; Huang, Yong-Quan; Shi, Wei; Cheng, Peng; Liao, Dai-Zheng; Yan, Shi-Ping |
Journal of publication | Crystal Growth & Design |
Year of publication | 2007 |
Journal volume | 7 |
Journal issue | 8 |
Pages of publication | 1483 |
a | 7.954 ± 0.003 Å |
b | 8.984 ± 0.004 Å |
c | 9.863 ± 0.004 Å |
α | 71.192 ± 0.004° |
β | 86.803 ± 0.004° |
γ | 64.858 ± 0.004° |
Cell volume | 601.2 ± 0.4 Å3 |
Cell temperature | 293 ± 2 K |
Ambient diffraction temperature | 293 ± 2 K |
Number of distinct elements | 5 |
Space group number | 2 |
Hermann-Mauguin space group symbol | P -1 |
Hall space group symbol | -P 1 |
Residual factor for all reflections | 0.0243 |
Residual factor for significantly intense reflections | 0.0225 |
Weighted residual factors for significantly intense reflections | 0.0578 |
Weighted residual factors for all reflections included in the refinement | 0.0587 |
Goodness-of-fit parameter for all reflections included in the refinement | 1.051 |
Diffraction radiation wavelength | 0.71073 Å |
Diffraction radiation type | MoKα |