Information card for entry 4504298
Formula | C25 H33 Cu N5 O6 |
Calculated formula | C25 H31 Cu N5 O6 |
Title of publication | Subtle Structural Changes in Coordination Chains: Influence of the Flexibility of the Precursor Ligands and of the Solvent |
Authors of publication | Wang, Cui-Juan; Ma, Hai-Rui; Wang, Yao-Yu; Liu, Ping; Zhou, Li-Jun; Shi, Qi-Zhen; Peng, Shie-Ming |
Journal of publication | Crystal Growth & Design |
Year of publication | 2007 |
Journal volume | 7 |
Journal issue | 9 |
Pages of publication | 1811 |
a | 20.212 ± 0.007 Å |
b | 8.517 ± 0.003 Å |
c | 18.456 ± 0.009 Å |
α | 90° |
β | 121.319 ± 0.005° |
γ | 90° |
Cell volume | 2714.2 ± 1.9 Å3 |
Cell temperature | 296 ± 2 K |
Ambient diffraction temperature | 296 ± 2 K |
Number of distinct elements | 5 |
Space group number | 15 |
Hermann-Mauguin space group symbol | C 1 2/c 1 |
Hall space group symbol | -C 2yc |
Residual factor for all reflections | 0.0784 |
Residual factor for significantly intense reflections | 0.0483 |
Weighted residual factors for significantly intense reflections | 0.1299 |
Weighted residual factors for all reflections included in the refinement | 0.1414 |
Goodness-of-fit parameter for all reflections included in the refinement | 0.977 |
Diffraction radiation wavelength | 0.71073 Å |
Diffraction radiation type | MoKα |